{"text_format":"1","workbook":"xlsx","n_sheets":9,"sheets":["Instruções","Resumo","Detalhe","Preços_Fixos","Preços_Index","ERSE_Precos_Fixos","ERSE_Precos_Index","ERSE_CondComerciais","ERSE_Aux"],"not_rendered":{"charts":0,"images":4,"macros":1,"external_links":0,"defined_names":7,"comments":0,"pivot_tables":0},"unopened":[],"bounds":{"document_bytes":16777216,"sheet_cells":100000,"rows_first":2000,"rows_last":500,"rows_between":2000,"halvings":0,"cell_chars":16384,"cell_head_chars":4096},"cells_cut":0,"cells_raw":0,"read":"whole","date_system":"1900"}

{"sheet":"Instruções","index":0,"n_rows":35,"n_cols":1,"rows_kept":35,"cut":false,"hidden":false,"merged":[]}
[]
["Instruções para o preenchimento do modelo de reporte dos preços de referência em Baixa Pressão Maior que 10 000 m3"]
["Detalhes contratuais particulares relativos às ofertas comerciais em Baixa Pressão superior a 10 000 m3, no âmbito da supervisão do mercado retalhista do setor elétrico e do setor de gás natural (Diretiva n.º 16/2024)."]
[]
["O modelo de reporte divide-se em quatro folhas de cálculo: (1) Resumo; (2) Detalhe, (3) Preços Fixos, (4) Preços Index. Os campos identificados com um sinal de asterisco, *, são de preenchimento obrigatório."]
[]
["A folha (1) \"Resumo\" apresenta de forma agregada os principais erros e alertas de preenchimento. O formulário deverá ser enviado à ERSE sem quaisquer erros de preenchimento e devidamente validado. Ao longo dos vários campos de preenchimento do formulário, estarão disponíveis mensagens de alertas, de modo a auxiliar o correto preenchimento do formulário. Caso existam erros de preenchimento, a oferta comercial não será carregada para o simulador de preços da ERSE."]
[]
["Para a correta utilização deste formulário deve observar-se os seguintes aspetos:\n1- As macros do formulário têm de ser ativadas no botão \"Ativar Conteúdo\";\n2- Não usar a opção \"Cortar\"/\"Colar\". Caso contrário, irá corromper o ficheiro. Em alternativa, usar a função \"Copiar\"/\"Colar Valor\";\n3- Não arrastar células. Caso contrário, irá corromper o ficheiro."]
[]
["De acordo com a Diretiva n.º 7/2024, as ofertas comerciais deverão ser comunicadas à ERSE sempre que se verificar alterações nas condições de preços ou das condições comerciais. Neste sentido, sempre que ocorrerem alterações nas Tarifas de Acesso às Redes (TAR), ou nos componentes da fórmula de indexação, ou outras condições de preços, essas alterações deverão ser comunicadas à ERSE. O incumprimento do envio desta informação tem por consequência a exclusão da oferta comercial do simulador de preços da ERSE, até ao envio de uma nova comunicação de informação atualizada."]
[]
["Esclarecimento da ERSE"]
["A ERSE reserva-se ao direito de, em algumas ofertas comerciais, disponibilizar um \"Esclarecimento da ERSE\", o qual visa informar o consumidor sobre as particularidades comerciais de algumas ofertas."]
[]
{"$rows_left_out":21}
{"sheet":"Resumo","index":1,"n_rows":14,"n_cols":1,"rows_kept":14,"cut":false,"hidden":false,"merged":[]}
[]
["Resumo de erros"]
[]
["De forma a facilitar o preenchimento do formulário de reporte de ofertas comerciais, foi criado um sistema de alarmística que identifica os erros formais detetados. Desta forma, para que o formulário possa ser enviado à ERSE para efeitos de colocação das ofertas comerciais no simulador de preços, não podem existir erros no seu preenchimento. Esta folha constitui um resumo dos erros identificados e define o status do preenchimento. A colocação das ofertas comerciais é sempre sujeita a avaliação complementar por parte da ERSE."]
[]
["1- Erros na folha \"Detalhe\""]
[{"$f":"+IF(AND(COUNTIF(Detalhe!E3:E80,\"erro\")=36,Preços_Fixos!Q11=0,Preços_Index!$Z$13=0),\"\",IF(COUNTIF(Detalhe!E3:E80,\"erro\")=0,\"Ok\",COUNTIF(Detalhe!E3:E80,\"erro\")))","v":""}]
["2-Erros na folha \"Preços Fixos\""]
[{"$f":"+IF(AND(COUNTIF(Detalhe!E3:E80,\"erro\")=36,Preços_Fixos!Q11=0,Preços_Index!$Z$13=0),\"\",\n\nIF(AND(Detalhe!C51=2,Preços_Fixos!R11>0),Preços_Fixos!R11,\n\nIF(AND(Detalhe!C51=1,Preços_Fixos!Q11=0),Preços_Fixos!R11,\n\nIF(AND(Detalhe!C51=1,Preços_Fixos!R11>0),Preços_Fixos!R11,\n\nIF(AND(Detalhe!C51=1,Preços_Fixos!Q11>0,Preços_Fixos!R11=0),\"Ok\",\n\nIF(AND(Detalhe!C51=0,Preços_Fixos!Q11>0),Preços_Fixos!R11,\n\n\"\"\n\n))))))","v":""}]
["2-Erros na folha \"Preços Index\""]
[{"$f":"+IF(AND(COUNTIF(Detalhe!E3:E80,\"erro\")=36,Preços_Fixos!Q11=0,Preços_Index!$Z$13=0),\"\",\n\nIF(AND(Detalhe!C51=1,Preços_Index!AA13>0),Preços_Index!AA13,\n\nIF(AND(Detalhe!C51=2,Preços_Index!Z13=0),Preços_Index!AA13,\n\nIF(AND(Detalhe!C51=2,Preços_Index!AA13>0),Preços_Index!AA13,\n\nIF(AND(Detalhe!C51=2,Preços_Index!Z13>0,Preços_Index!AA13=0),\"Ok\",\n\nIF(AND(Detalhe!C51=0,Preços_Index!Z13>0),\n\nPreços_Index!AA13,\"\"\n\n))))))","v":""}]
["4-Estado do formulário"]
[]
[{"$f":"+IF(AND(A7=\"\",A9=\"\",A11=\"\"),\"\",IF(AND(A7=\"ok\",A9=\"ok\",A11=\"ok\"),\"O formulário pode ser submetido\",\n\nIF(AND(A7=\"ok\",AND(OR(A9=0,A9=\"\"),OR(A11=0,A11=\"\"))),\"O formulário apresenta erros que têm de ser corrigidos para poder ser submetido\",\n\nIF(AND(A7=\"ok\",OR(A9=\"ok\",A9=\"\"),OR(A11=\"ok\",A11=\"\")),\"O formulário pode ser submetido\",\n\n\"O formulário apresenta erros que têm de ser corrigidos para poder ser submetido\"))))","v":""}]

{"sheet":"Detalhe","index":2,"n_rows":80,"n_cols":7,"rows_kept":80,"cut":false,"hidden":false,"merged":[[49,6,49,20],[43,6,43,17]]}
[null,null,{"$f":"+IF(COUNTIF(E3:E80,\"=\"&\"ERRO\")>0,\"Campos com ERRO (Nº de ERROS = \"&COUNTIF(E3:E80,\"=\"&\"ERRO\")&\")\",\"\")","v":"Campos com ERRO (Nº de ERROS = 36)"}]
["1.","Identificação do comercializador, marca comercial e da oferta comercial"]
["1.0","Nome do Comercializador *",null,"Texto",{"$f":"+IF(C3=\"\",\"ERRO\",\"\")","v":"ERRO"},null,"Designação fiscal do Comercializador."]
["1.1","Código CRIA *",null,"Texto",{"$f":"+IF(C4=\"\",\"ERRO\",\"\")","v":"ERRO"},null,"Identificação do código CRIA do comercializador, através dos sete primeiros caracteres. Por exemplo: COM1234."]
["1.2","Marca comercial*",null,"Texto",{"$f":"+IF(C5=\"\",\"ERRO\",\"\")","v":"ERRO"},null,"Designação da marca comercial. Esta será a designação comercial que irá constar no simulador de preços da ERSE."]
["1.3","Nome da Oferta comercial *",null,"Texto",{"$f":"+IF(C6=\"\",\"ERRO\",\"\")","v":"ERRO"},null,"Designação completa da oferta comercial. Este será o nome da oferta comercial que irá constar no simulador de preços da ERSE."]
[null,"1.3.1 - Modalidade da oferta comercial",null,"Texto",null,null,"Esta informação não será disponibilizada ao público, mas permite à ERSE distinguir diferentes modalidades da mesma oferta comercial (p.e. descontos por débito direto, e/ou faturação eletrónica)."]
["1.4","Descrição da oferta comercial a incluir no simulador de preços da ERSE *",null,null,{"$f":"+IF(C8=\"\",\"ERRO\",\"\")","v":"ERRO"},null,"Esta descrição será disponibilizada ao público como descrição da oferta. Permite detalhar as características da oferta. O campo está limitado a 750 caracteres."]
["1.5","Segmento da oferta *",null,"Escolha",{"$f":"+IF(OR(C9=\"\",C9=0),\"ERRO\",\"\")","v":"ERRO"},null,"Especificação do segmento a que a oferta se destina. Para um preenchimento automático deve ser tido em conta a seguinte codificação: 2=Todos, 3=Doméstico, 4=Não-doméstico."]
["1.6","Endereço web da marca do comercializador *",null,"Web",{"$f":"+IF(C10=\"\",\"ERRO\",\"\")","v":"ERRO"},null,"Endereço web da marca do comercializador. Preencher com o website do comercializador."]
["1.7","Endereço web da oferta comercial*",null,"Web","ERRO",null,"Endereço web da oferta comercial."]
["1.8","Endereço web da ficha contratual padronizada*",null,"Web",{"$f":"+IF(C13=\"\",\"ERRO\",\"\")","v":"ERRO"},null,"Endereço web da ficha contratual padronizada da oferta comercial."]
["1.9","Endereço web das condições gerais do contrato*",null,"Web",{"$f":"+IF(C14=\"\",\"ERRO\",\"\")","v":"ERRO"},null,"Endereço web com as condições gerais do contrato da oferta comercial."]
["1.10","Contacto comercial telefónico*",null,"Número","ERRO",null,"Identificação do contacto para questões comerciais. Introduzir apenas um contacto."]
["1.11","Contacto comercial eletrónico*",null,"E-mail/ Web","ERRO",null,"Contacto eletrónico para questões comerciais. Introduzir apenas um contacto eletrónico (E-mail ou Endereço web)."]
{"$rows_left_out":66}
{"sheet":"Preços_Fixos","index":3,"n_rows":19,"n_cols":19,"rows_kept":19,"cut":false,"hidden":false,"merged":[[14,1,14,3],[14,8,14,10],[13,1,13,3],[13,8,13,10],[5,2,5,3],[5,9,5,10],[10,1,10,3],[10,8,10,10],[11,1,12,1],[11,2,11,3],[11,8,12,8],[11,9,11,10],[12,2,12,3],[12,9,12,10],[8,2,8,3],[8,9,8,10]]}
[]
["Fornecimento Gás BP>10 000 m3 - 1.º Período",null,null,null,null,null,null,null,"Fornecimento Gás BP>10 000 m3 - 2.º Período",null,null,null,null,null,null,null,"vazio","erros"]
[]
["Duração 1.º período (meses) =",null,null,"*",null,null,null,null,"Duração 2.º período (meses) =",null,null,null,null,null,null,null,{"$f":"+IF(OR(E6=3,E6=\"\"),COUNTA(F11:F15,C4,K4,M11:M15,E9),COUNTA(F11:F15,C4,K4,M11:M15,E6,E9))","v":0},{"$f":"+COUNTIF(B18,S4)+COUNTIF(I18,S4)","v":0},"Campos obrigatórios por preencher"]
[null,null,{"$f":"IF(OR(Detalhe!C51=2,Detalhe!C51=\"\",COUNT(F11:F15,M11:M15,E6,E9:F9)=0),\"\",\n\nIF(AND($C$4=\"\",$K$4=\"\",Detalhe!$C$19=\"\"),\"\",IF(AND($C$4+$K$4<>Detalhe!$C$19,OR(Detalhe!$C$18=2,Detalhe!$C$18=4,Detalhe!$C$18=1)),\"Erro - O número total de meses não é igual ao definido no campo 2.2 da folha 'Detalhe'.\",\"\")))","v":""},null,null,null,null,null,null,null,{"$f":"IF(OR(Detalhe!C51=2,Detalhe!C51=\"\",COUNT(M11:M15,F11:F15,E6,L9:M9)=0),\"\",\n\nIF(AND($C$4=\"\",$K$4=\"\",Detalhe!$C$19=\"\"),\"\",IF(AND($C$4+$K$4<>Detalhe!$C$19,OR(Detalhe!$C$18=2,Detalhe!$C$18=4,Detalhe!$C$18=1)),\"Erro - O número total de meses não é igual ao definido no campo 2.2 da folha 'Detalhe'.\",\"\")))","v":""},null,null,null,null,null,null,{"$f":"+COUNTIF(C5,S5)+COUNTIF(K5,S5)","v":0},"Erro - O número total de meses não é igual ao definido no campo 2.2 da folha 'Detalhe'."]
[null,null,"Opção tarifária",null,null,"*",null,null,null,"Opção tarifária",null,null,null,null,null,null,null,{"$f":"+COUNTIF(B18,S6)+COUNTIF(I18,S6)","v":0},"Não se aplica capacidade utilizada"]
[]
[null,null,null,null,"Mínimo","Máximo",null,null,null,null,null,"Mínimo","Máximo",null,null,null,null,{"$f":"+COUNTIF(B18,S8)+COUNTIF(I18,S8)","v":0},"Apagar valores do 2.º período"]
[null,null,"Escalão (m3/ano)",null,null,null,"*",null,null,"Escalão (m3/ano)",null,{"$f":"+IF(K4>0,E9,\"\")","v":""},{"$f":"+IF(K4>0,F9,\"\")","v":""},{"$f":"+IF($K$4>0,IF($E$6>=1,\"*\",\"\"),\"\")","v":""},null,null,null,{"$f":"+COUNTIF(B19,S9)","v":0},"Oferta a preços indexados: não preencher esta folha"]
[null,null,null,null,null,null,null,null,null,null,null,","]
[null,"Termo tarifário fixo",null,null,"EUR/dia",null,{"$f":"+IF(AND($E$6>=1,E6<3),\"*'\",\"\")","v":""},null,"Termo tarifário fixo",null,null,"EUR/dia",null,{"$f":"+IF($K$4>0,IF(AND($E$6>=1,E6<3),\"*'\",\"\"),\"\")","v":""},null,null,{"$f":"+Q4","v":0},{"$f":"SUM(R4:R9)","v":0}]
[null,"Energia","Fora de Vazio",null,"EUR/kWh",null,{"$f":"+IF(AND($E$6>=1,E6<3),\"*'\",\"\")","v":""},null,"Energia","Fora de Vazio",null,"EUR/kWh",null,{"$f":"+IF($K$4>0,IF(AND($E$6>=1,E6<3),\"*'\",\"\"),\"\")","v":""}]
[null,null,"Vazio",null,"EUR/kWh",null,{"$f":"+IF(AND($E$6>=1,E6<3),\"*'\",\"\")","v":""},null,null,"Vazio",null,"EUR/kWh",null,{"$f":"+IF($K$4>0,IF(AND($E$6>=1,E6<3),\"*'\",\"\"),\"\")","v":""}]
[null,"Capacidade Utilizada",null,null,"EUR/(kWh/dia)/dia",null,{"$f":"+IF(AND($E$6=1,E6<3),\"*'\",\"\")","v":""},null,"Capacidade Utilizada",null,null,"EUR/(kWh/dia)/dia",null,{"$f":"+IF($K$4>0,IF(AND($E$6=1,E6<3),\"*'\",\"\"),\"\")","v":""}]
[null,"Capacidade Utilizada à Entrada",null,null,"EUR/(kWh/dia)/dia",null,{"$f":"+IF(AND($E$6>=1,E6<3),\"*'\",\"\")","v":""},null,"Capacidade Utilizada à Entrada",null,null,"EUR/(kWh/dia)/dia",null,{"$f":"+IF($K$4>0,IF(AND($E$6>=1,E6<3),\"*'\",\"\"),\"\")","v":""}]
{"$rows_left_out":5}
{"sheet":"Preços_Index","index":4,"n_rows":59,"n_cols":28,"rows_kept":59,"cut":false,"hidden":false,"merged":[[11,1,11,9],[58,1,58,16],[38,5,38,6],[39,5,39,6],[36,3,36,4],[37,3,37,4],[38,3,38,4],[39,3,39,4],[33,2,33,10],[17,4,17,5],[25,4,25,7],[36,5,36,6],[37,5,37,6]]}
[]
[]
[]
["Fornecimento - Gás: detalhe das condições de preços indexados"]
[null,null,null,null,null,null,null,null,null,null,null,null,null,null,null,null,null,null,null,null,null,null,null,null,null,"vazio","erros"]
[null,"Nas situações em que se aplicam condições de preços indexados/dinâmicos, os comercializadores deverão preencher os seguintes campos em branco, de modo a",null,null,null,null,null,null,null,null,null,null,null,null,null,null,null,null,null,null,null,null,null,null,null,{"$f":"+IF(OR(F28=\"\",F28=3),COUNTA(E20:F23,G20,E26,E31,F38:G40),COUNTA(E20:F23,G20,E26,F28,E31,F38:G40))","v":0},{"$f":"+COUNTIF(H20,AB6)","v":0},"Indicar unidade do indexante de mercado."]
[null,"detalhar os valores dos respetivos indexantes associados às condições de indexação da oferta comercial.",null,null,null,null,null,null,null,null,null,null,null,null,null,null,null,null,null,null,null,null,null,null,null,null,{"$f":"+COUNTIF(F41,AB7)+COUNTIF(E25,AB7)","v":0},"Os campos * são de preenchimento obrigatório"]
[null,null,null,null,null,null,null,null,null,null,null,null,null,null,null,null,null,null,null,null,null,null,null,null,null,null,{"$f":"+COUNTIF(E27,AB8)","v":0},"Indicar referencial de indexante de mercado"]
[null,"Para efeitos do reporte à ERSE, devem ser transpostos os elementos que compõem a fórmula de indexação dos preços para a expressão apresentada, através da",null,null,null,null,null,null,null,null,null,null,null,null,null,null,null,null,null,null,null,null,null,null,null,null,{"$f":"+COUNTIF(E29,AB9)","v":0},"Indicar opção horária"]
[null,"decomposição e simplificação matemática:",null,null,null,null,null,null,null,null,null,null,null,null,null,null,null,null,null,null,null,null,null,null,null,null,{"$f":"+COUNTIF(E32,AB10)","v":0},"Indicar escalão de consumo"]
[null,null,null,null,null,null,null,null,null,null,null,null,null,null,null,null,null,null,null,null,null,null,null,null,null,null,{"$f":"+COUNTIF(F41,AB11)","v":0},"Não se aplica capacidade utilizada"]
[null,"Preço total (EUR) = Componente Variável (EUR/kWh) x Consumo (kWh)  + Componente Fixa (EUR/dia) x N.º dias de consumo",null,null,null,null,null,null,null,null,null,null,null,null,null,null,null,null,null,null,null,null,null,null,null,null,{"$f":"+COUNTIF(E13,AB12)","v":0},"Oferta a preços fixos: não preencher esta folha"]
[null,null,null,null,{"$f":"+IF(AND(Detalhe!C51=1,Z13>0),\"Oferta a preços fixos: não preencher esta folha\",\"\")","v":""},null,null,null,null,null,null,null,null,null,null,null,null,null,null,null,null,null,null,null,null,{"$f":"+Z6","v":0},{"$f":"SUM(AA6:AA12)","v":0}]
[]
[null,null,"Componente Variável (EUR/kWh) = A x α + β + TAR(Energia) BP>"]
{"$rows_left_out":45}
{"sheet":"ERSE_Precos_Fixos","index":5,"n_rows":3,"n_cols":13,"rows_kept":3,"cut":false,"hidden":true,"merged":[]}
[]
[null,"#","COD_CRIA","COM","COD_Proposta","TF_GN","FV_GN","V_GN","Cap_Util","Cap_Ent","Opção Tarifária","Escalão Mínimo","Escalão Máximo"]
[null,1,{"$f":"+IF(Detalhe!$C$4=\"\",\"\",Detalhe!$C$4)","v":""},{"$f":"+IF(Detalhe!$C$5=\"\",\"\",Detalhe!$C$5)","v":""},{"$f":"+ERSE_Precos_Fixos!$D3&$A$4&\"_\"&ERSE_Aux!$C$3","v":{"$error":"#N/A"}},{"$f":"+IF(Preços_Fixos!F11=\"\",\"\",IF(AND(SUM(Preços_Fixos!$F$11:$F$15)>0,SUM(Preços_Fixos!$M$11:$M$15)=0),Preços_Fixos!F11,Preços_Fixos!F11*Preços_Fixos!$C$4/(SUM(Preços_Fixos!$C$4,Preços_Fixos!$K$4))+Preços_Fixos!M11*Preços_Fixos!$K$4/SUM(Preços_Fixos!$C$4,Preços_Fixos!$K$4)))","v":""},{"$f":"+IF(Preços_Fixos!F12=\"\",\"\",IF(AND(SUM(Preços_Fixos!$F$11:$F$15)>0,SUM(Preços_Fixos!$M$11:$M$15)=0),Preços_Fixos!F12,Preços_Fixos!F12*Preços_Fixos!$C$4/(SUM(Preços_Fixos!$C$4,Preços_Fixos!$K$4))+Preços_Fixos!M12*Preços_Fixos!$K$4/SUM(Preços_Fixos!$C$4,Preços_Fixos!$K$4)))","v":""},{"$f":"+IF(Preços_Fixos!F13=\"\",\"\",IF(AND(SUM(Preços_Fixos!$F$11:$F$15)>0,SUM(Preços_Fixos!$M$11:$M$15)=0),Preços_Fixos!F13,Preços_Fixos!F13*Preços_Fixos!$C$4/(SUM(Preços_Fixos!$C$4,Preços_Fixos!$K$4))+Preços_Fixos!M13*Preços_Fixos!$K$4/SUM(Preços_Fixos!$C$4,Preços_Fixos!$K$4)))","v":""},{"$f":"+IF(Preços_Fixos!F14=\"\",\"\",IF(AND(SUM(Preços_Fixos!$F$11:$F$15)>0,SUM(Preços_Fixos!$M$11:$M$15)=0),Preços_Fixos!F14,Preços_Fixos!F14*Preços_Fixos!$C$4/(SUM(Preços_Fixos!$C$4,Preços_Fixos!$K$4))+Preços_Fixos!M14*Preços_Fixos!$K$4/SUM(Preços_Fixos!$C$4,Preços_Fixos!$K$4)))","v":""},{"$f":"+IF(Preços_Fixos!F15=\"\",\"\",IF(AND(SUM(Preços_Fixos!$F$11:$F$15)>0,SUM(Preços_Fixos!$M$11:$M$15)=0),Preços_Fixos!F15,Preços_Fixos!F15*Preços_Fixos!$C$4/(SUM(Preços_Fixos!$C$4,Preços_Fixos!$K$4))+Preços_Fixos!M15*Preços_Fixos!$K$4/SUM(Preços_Fixos!$C$4,Preços_Fixos!$K$4)))","v":""},{"$f":"+IF(ERSE_Aux!C90=\"\",\"\",ERSE_Aux!C90)","v":{"$error":"#N/A"}},{"$f":"+IF(Preços_Fixos!E9=\"\",\"\",Preços_Fixos!E9)","v":""},{"$f":"+IF(Preços_Fixos!F9=\"\",\"\",Preços_Fixos!F9)","v":""}]

{"sheet":"ERSE_Precos_Index","index":6,"n_rows":3,"n_cols":23,"rows_kept":3,"cut":false,"hidden":true,"merged":[]}
[]
[null,"#","COD_CRIA","COM","COD_Proposta","TF_GN","FV_GN","V_GN","Cap_Util","Cap_Ent","A_FV","A_V","alfa_FV","alfa_V","beta_FV","beta_V","TAR_FV","TAR_V","Opção Tarifária","Escalão Mínimo","Escalão Máximo","Indexante_GN","Unidade_indexante_ELE"]
[null,1,{"$f":"+IF(Detalhe!$C$4=\"\",\"\",Detalhe!$C$4)","v":""},{"$f":"+IF(Detalhe!$C$5=\"\",\"\",Detalhe!$C$5)","v":""},{"$f":"+ERSE_Precos_Index!$D3&$A$4&\"_\"&ERSE_Aux!$C$3","v":{"$error":"#N/A"}},{"$f":"+IF(Preços_Index!F38=\"\",\"\",Preços_Index!F38)","v":""},{"$f":"+IF(Preços_Index!E24=\"\",\"\",Preços_Index!E24)","v":""},{"$f":"+IF(Preços_Index!F24=\"\",\"\",Preços_Index!F24)","v":""},{"$f":"+IF(Preços_Index!F39=\"\",\"\",Preços_Index!F39)","v":""},{"$f":"+IF(Preços_Index!F40=\"\",\"\",Preços_Index!F40)","v":""},{"$f":"+IF(Preços_Index!E20=\"\",\"\",Preços_Index!E20)","v":""},{"$f":"+IF(Preços_Index!F20=\"\",\"\",Preços_Index!F20)","v":""},{"$f":"+IF(Preços_Index!E21=\"\",\"\",Preços_Index!E21)","v":""},{"$f":"+IF(Preços_Index!F21=\"\",\"\",Preços_Index!F21)","v":""},{"$f":"+IF(Preços_Index!E22=\"\",\"\",Preços_Index!E22)","v":""},{"$f":"+IF(Preços_Index!F22=\"\",\"\",Preços_Index!F22)","v":""},{"$f":"+IF(Preços_Index!E23=\"\",\"\",Preços_Index!E23)","v":""},{"$f":"+IF(Preços_Index!F23=\"\",\"\",Preços_Index!F23)","v":""},{"$f":"+IF(ERSE_Aux!C90=\"\",\"\",ERSE_Aux!C90)","v":{"$error":"#N/A"}},{"$f":"+IF(Preços_Index!E31=\"\",\"\",Preços_Index!E31)","v":""},{"$f":"+IF(Preços_Index!F31=\"\",\"\",Preços_Index!F31)","v":""},{"$f":"IF(Preços_Index!$E$26=\"\",\"\",Preços_Index!$E$26)","v":""},{"$f":"IF(Preços_Index!$G$20=\"\",\"\",Preços_Index!$G$20)","v":""}]

{"sheet":"ERSE_CondComerciais","index":7,"n_rows":3,"n_cols":61,"rows_kept":3,"cut":false,"hidden":true,"merged":[]}
[null,null,"1.0_Comercializador",null,"1.3_Nome_proposta","1.3.1_Modalidade","1.5_SegmentoOferta",null,null,"2.1_Fornecimento","2.2_Duração contrato","2.3_Data início","2.4_Data de fim","2.5_Web-Pres-Telef","2.6_FE-papel","2.7_DD-MB-Loja","2.8_Escr-Pres-Tel-Elec","2.10_Fidelização Não/Sim","2.11_GN 100%Renovavel Não/Sim","2.13_RestricoesAdic Não/Sim","2.15_PrecosIndex GN _Não/Sim","3.1_ServicosAdic Não/Sim","Não/Sim","4.1_reembolsos Não/Sim","4.2_desconto Novos Clientes Não/Sim","3.1.1_ServAdic sem IVA (€/ano)","3.1.2_ServAdic com IVA (€/ano)","4.1.1_ReembFixo","4.1.2_ReembTFixo_ELE","4.1.3_ReembTVaria_ELE","4.1.4_ReembEnergia_ELE","4.2.1_ReembFixo","4.2.2_ReembTFixo_ELE","4.2.3_ReembTVaria_ELE","4.2.4_ReembEnergia_ELE","1.3_Detalhe",null,"1.6_WebComercializador","1.7_LinkOfertaCom","1.8_LinkFichaPadronizada","1.9_LinkCondiçõesGerais","1.10_ContactoComTEL","1.11_ContactoEletronic","2.5.Contrat_Elect","2.5.Contrat_Presencial","2.5.Contrat_Telef","2.5_Elec|Presen|Tel","2.6_Ele|Papel","2.7_DD|MB/Transf|Loja/Agente","2.8_Escrito|Presen|Tel|Ele","2.9_ModalidadeFaturacao","2.10.1_Fidelização","2.13_RestricoesAdicionais","2.14_Detalhe OutrosDescontos/beneficios","2.15_Atualizacao preços","3.1.2_DetalheSerAdic","3.2_DetalheOutrosSerAdic","4.1.8/4.2.8_DetalheReembolsos e Detalhe Desconto Novo Cliente","Preços diferentes no periodo","1.1_CRIA","1.2_Marca Comercial"]
[null,"#","COM","CODProposta","NomeProposta","TxTModalidade","Segmento","ConsIni_GN","ConsFim_GN","Fornecimento","DuracaoContrato","Data ini","Data fim","FiltroContratacao","Filtrofaturacao","FiltroPagamento","FiltroAtendimento","FiltroFidelização","FiltroRenovavel","FiltroRestrições","FiltroPrecosIndex_GN","FiltroServicosAdic","FiltroTarifaSocial","FiltroReembolsos","Filtro Novos Clientes","CustoServicos_s/IVA (€/ano)","CustoServicos_c/IVA (€/ano)","ReembFixo (€/ano)","ReembTF_GN (%)","ReembTW_GN (%)","ReembW_GN (€/kWh)","Desc. Fixo (€/ano) - Novo Cliente","Desc. TF_GN (%) - Novo Cliente","Desc. TW_GN (%) - Novo Cliente","Desc. W_GN (€/kWh) - Novo Cliente","TxTOferta","TxTERSE","LinkCOM","LinkOfertaCom","LinkFichaPadrao","LinkCondicoesGerais","ContactoComercialTel","ContactoWEBouMAIL","Contrat_Elect","Contrat_Presen","Contrat_Telef","TxTContratação","TxTFatura","TxTPagamento","TxTAtendimento","TxTFaturacao","TxTFidelização","TxT Condicionadas","DetalheOutrosBen ","TxTAtualizaPrecos","TxTServicoAdic","TxToutrosServicoAdic","TxTReembolsos","PrecosPeriodo","COD_CRIA","Marca_COM"]
[null,1,{"$f":"+IF(Detalhe!C3=\"\",\"\",Detalhe!C3)","v":""},{"$f":"+ERSE_Precos_Fixos!$E3","v":{"$error":"#N/A"}},{"$f":"+IF(Detalhe!C6=\"\",\"\",Detalhe!C6)","v":""},{"$f":"IF(Detalhe!$C$7=\"\",\"\",Detalhe!$C$7)","v":""},{"$f":"IF(ERSE_Aux!$C$9=\"\",\"\",ERSE_Aux!$C$9)","v":{"$error":"#N/A"}},{"$f":"+IF(Detalhe!$C$79=\"\",\"\",Detalhe!$C$79)","v":""},{"$f":"+IF(Detalhe!$C$80=\"\",\"\",Detalhe!$C$80)","v":""},{"$f":"+IF(ERSE_Aux!$C$3=\"\",\"\",ERSE_Aux!$C$3)","v":{"$error":"#N/A"}},{"$f":"IF(Detalhe!$C19=\"\",\"\",Detalhe!$C19)","v":""},{"$f":"+IF(Detalhe!C20=\"\",\"\",Detalhe!C20)","v":""},{"$f":"+IF(Detalhe!C21=\"\",\"\",Detalhe!C21)","v":""},{"$f":"+IF(ERSE_Aux!$C$31=\"\",\"\",ERSE_Aux!$C$31)","v":"000"},{"$f":"+IF(ERSE_Aux!C41=\"\",\"\",ERSE_Aux!C41)","v":"00"},{"$f":"+IF(ERSE_Aux!C36=\"\",\"\",ERSE_Aux!C36)","v":"000"},{"$f":"N(Detalhe!$C34)&N(Detalhe!$C35)&N(Detalhe!$C36)&N(Detalhe!$C37)","v":"0000"},{"$f":"+IFERROR(ERSE_Aux!C15,\"N\")","v":"N"},{"$f":"+IFERROR(ERSE_Aux!C45,\"N\")","v":"N"},{"$f":"+IFERROR(ERSE_Aux!$C$55,\"N\")","v":"N"},{"$f":"+IFERROR(ERSE_Aux!$C$82,\"N\")","v":"N"},{"$f":"+IFERROR(ERSE_Aux!$C$19,\"N\")","v":"N"},"N",{"$f":"+IFERROR(ERSE_Aux!$C$23,\"N\")","v":"N"},{"$f":"+IFERROR(ERSE_Aux!$C$27,\"N\")","v":"N"},{"$f":"+IF(Detalhe!$C$57=\"\",\"\",Detalhe!$C$57)","v":""},{"$f":"+IF(Detalhe!$C$58=\"\",\"\",Detalhe!$C$58)","v":""},{"$f":"+IF(AND(Detalhe!$C$64<>0,Detalhe!$C$64<>\"\"),ABS(Detalhe!$C$64),0)","v":0},{"$f":"+IF(AND(Detalhe!$C$65<>0,Detalhe!$C$65<>\"\"),ABS(Detalhe!$C$65),0)","v":0},{"$f":"+IF(AND(Detalhe!$C$66<>0,Detalhe!$C$66<>\"\"),ABS(Detalhe!$C$66),0)","v":0},{"$f":"+IF(AND(Detalhe!$C$67<>0,Detalhe!$C$67<>\"\"),ABS(Detalhe!$C$67),0)","v":0},{"$f":"+IF(AND(Detalhe!$C$71<>0,Detalhe!$C$71<>\"\"),ABS(Detalhe!$C$71),0)","v":0},{"$f":"+IF(AND(Detalhe!$C$72<>0,Detalhe!$C$72<>\"\"),ABS(Detalhe!$C$72),0)","v":0},{"$f":"+IF(AND(Detalhe!$C$73<>0,Detalhe!$C$73<>\"\"),ABS(Detalhe!$C$73),0)","v":0},{"$f":"+IF(AND(Detalhe!$C$74<>0,Detalhe!$C$74<>\"\"),ABS(Detalhe!$C$74),0)","v":0},{"$f":"IF(Detalhe!$C8=\"\",\"\",Detalhe!$C8)","v":""},{"$f":"IF(Instruções!A15=\"\",\"\",Instruções!A15)","v":""},{"$f":"+IF(Detalhe!$C$10=\"\",\"\",Detalhe!$C$10)","v":""},{"$f":"+IF(Detalhe!$C$11=\"\",\"\",Detalhe!$C$11)","v":""},{"$f":"+IF(Detalhe!$C$12=\"\",\"\",Detalhe!$C$12)","v":""},{"$f":"+IF(Detalhe!$C$13=\"\",\"\",Detalhe!$C$13)","v":""},{"$f":"+IF(Detalhe!$C$14=\"\",\"\",Detalhe!$C$14)","v":""},{"$f":"+IF(Detalhe!$C$15=\"\",\"\",Detalhe!$C$15)","v":""},{"$f":"IF(Detalhe!C23=\"\",\"\",Detalhe!C23)","v":""},{"$f":"IF(Detalhe!C24=\"\",\"\",Detalhe!C24)","v":""},{"$f":"IF(Detalhe!C25=\"\",\"\",Detalhe!C25)","v":""},{"$f":"IF(+ERSE_Aux!$D$31=\"\",\"\",+ERSE_Aux!$D$31)","v":""},{"$f":"+IF(ERSE_Aux!$D$41=\"\",\"\",ERSE_Aux!$D$41)","v":""},{"$f":"+IF(ERSE_Aux!$D$36=\"\",\"\",ERSE_Aux!$D$36)","v":""},{"$f":"+IF(ERSE_Aux!$D$49=\"\",\"\",ERSE_Aux!$D$49)","v":""},{"$f":"IF(Detalhe!$C38=\"\",\"\",Detalhe!$C38)","v":""},{"$f":"+IF(Detalhe!C40=\"\",\"\",Detalhe!C40)","v":""},{"$f":"+IF(ERSE_Aux!$D$59=\"\",\"\",ERSE_Aux!$D$59)","v":""},{"$f":"IF(Detalhe!$C45=\"\",\"\",Detalhe!$C45)","v":""},{"$f":"IF(AND(ERSE_Aux!C73=\"\"),\"\",ERSE_Aux!C73)","v":""},{"$f":"IF(Detalhe!$C59=\"\",\"\",Detalhe!$C59)","v":""},{"$f":"IF(Detalhe!$C60=\"\",\"\",Detalhe!$C60)","v":""},{"$f":"IF(ERSE_Aux!C76&ERSE_Aux!C77=\"\",\"\",ERSE_Aux!D76&\" \"&ERSE_Aux!D77)","v":""},{"$f":"+ERSE_Aux!C79","v":"N"},{"$f":"+IF(Detalhe!$C$4=\"\",\"\",Detalhe!$C$4)","v":""},{"$f":"+IF(Detalhe!$C$5=\"\",\"\",Detalhe!$C$5)","v":""}]

{"sheet":"ERSE_Aux","index":8,"n_rows":93,"n_cols":6,"rows_kept":93,"cut":false,"hidden":true,"merged":[]}
[null,"Comboboxes"]
[]
[null,"Tipo_fornecimento = ",{"$f":"+INDEX(ERSE_Aux!$C$4:$C$7,MATCH(Detalhe!$C$18,ERSE_Aux!$A$4:$A$7,0))","v":{"$error":"#N/A"}}]
[1,"Gás","GN"]
[2]
[3]
[4]
[]
[null,"Segmento =",{"$f":"+INDEX(ERSE_Aux!$C$10:$C$13,MATCH(Detalhe!$C$9,ERSE_Aux!$A$10:$A$13,0))","v":{"$error":"#N/A"}}]
[1,"Não doméstico","Ndom"]
[2]
[{"$f":"+A11+1","v":3}]
[{"$f":"+A12+1","v":4}]
[]
[null,"Fidelização =",{"$f":"+INDEX(ERSE_Aux!$C$16:$C$17,MATCH(Detalhe!$C$39,ERSE_Aux!$A$16:$A$17,0))","v":{"$error":"#N/A"}}]
{"$rows_left_out":78}